Camel blueprint unit tests failed in Fuse 6.2.1

Solution Verified - Updated -


When running camel blueprint unit tests, we see the following errors:

  • java.lang.IllegalArgumentException: Property placeholder key: xxx not found

  • org.osgi.service.blueprint.container.NoSuchComponentException: No component with id 'blueprintBundle' could be found

  • java.lang.RuntimeException: InputStream cannot be null


  • Red Hat JBoss Fuse 6.2.1 (no patch)

Subscriber exclusive content

A Red Hat subscription provides unlimited access to our knowledgebase, tools, and much more.

Current Customers and Partners

Log in for full access

Log In

New to Red Hat?

Learn more about Red Hat subscriptions

Using a Red Hat product through a public cloud?

How to access this content